BDBM264350 US9714247, 71
SMILES CCn1c2cc(Nc3ccc(F)cn3)ncc2cc(-c2ccccc2Cl)c1=O
InChI Key InChIKey=NRANDNLZNDZJKK-UHFFFAOYSA-N
Data  3 IC50
  Tab Delimited (TSV)   2D SDfile   Computed 3D by Vconf -m prep SDfile
Find this compound or compounds like it in BindingDB:
Activity Spreadsheet -- Enzyme Inhibition Constant Data from BindingDB
Found 3 hits for monomerid = 264350
TargetTyrosine-protein kinase BTK(Homo sapiens (Human))
Tolero Pharmaceuticals
US Patent
LigandPNGBDBM264350(US9714247, 71)
Affinity DataIC50:  3.00E+3nM. Assay description: A concentration of a drug that reduces the observed activity of an enzyme by 50%. An IC50 is not a true affinity constant and the specific value dete...
Ligand InfoPC cidPC sid
In DepthDetails US Patent
TargetTyrosine-protein kinase Lyn(Homo sapiens (Human))
Tolero Pharmaceuticals
US Patent
LigandPNGBDBM264350(US9714247, 71)
Affinity DataIC50:  550nM. Assay description: A concentration of a drug that reduces the observed activity of an enzyme by 50%. An IC50 is not a true affinity constant and the specific value dete...
Ligand InfoPC cidPC sid
In DepthDetails US Patent
TargetProto-oncogene tyrosine-protein kinase Src(Homo sapiens (Human))
Tolero Pharmaceuticals
US Patent
LigandPNGBDBM264350(US9714247, 71)
Affinity DataIC50: <100nM. Assay description: A concentration of a drug that reduces the observed activity of an enzyme by 50%. An IC50 is not a true affinity constant and the specific value dete...
Ligand InfoPC cidPC sid
In DepthDetails US Patent