BDBM264376 US9714247, 97
SMILES CCN(CC)CCOc1ccc(Nc2cc3n(CC)c(=O)c(cc3cn2)-c2c(F)ccc(Cl)c2F)nc1
InChI Key InChIKey=NYODZZBZDWAACH-UHFFFAOYSA-N
Data  3 IC50
  Tab Delimited (TSV)   2D SDfile   Computed 3D by Vconf -m prep SDfile
Find this compound or compounds like it in BindingDB:
Activity Spreadsheet -- Enzyme Inhibition Constant Data from BindingDB
Found 3 hits for monomerid = 264376
TargetTyrosine-protein kinase BTK(Homo sapiens (Human))
Tolero Pharmaceuticals
US Patent
LigandPNGBDBM264376(US9714247, 97)
Affinity DataIC50:  550nM. Assay description: A concentration of a drug that reduces the observed activity of an enzyme by 50%. An IC50 is not a true affinity constant and the specific value dete...
Ligand InfoPC cidPC sid
In DepthDetails US Patent
TargetTyrosine-protein kinase Lyn(Homo sapiens (Human))
Tolero Pharmaceuticals
US Patent
LigandPNGBDBM264376(US9714247, 97)
Affinity DataIC50: <100nM. Assay description: A concentration of a drug that reduces the observed activity of an enzyme by 50%. An IC50 is not a true affinity constant and the specific value dete...
Ligand InfoPC cidPC sid
In DepthDetails US Patent
TargetProto-oncogene tyrosine-protein kinase Src(Homo sapiens (Human))
Tolero Pharmaceuticals
US Patent
LigandPNGBDBM264376(US9714247, 97)
Affinity DataIC50: <100nM. Assay description: A concentration of a drug that reduces the observed activity of an enzyme by 50%. An IC50 is not a true affinity constant and the specific value dete...
Ligand InfoPC cidPC sid
In DepthDetails US Patent