BDBM264416 US9714247, 138
SMILES CN(C1CCN(C)CC1)c1ccc(Nc2cc3n(C4CCC4)c(=O)c(cc3cn2)-c2c(F)cccc2F)nc1
InChI Key InChIKey=ZATOVHRPIVWBOH-UHFFFAOYSA-N
Data  3 IC50
  Tab Delimited (TSV)   2D SDfile   Computed 3D by Vconf -m prep SDfile
Find this compound or compounds like it in BindingDB:
Activity Spreadsheet -- Enzyme Inhibition Constant Data from BindingDB
Found 3 hits for monomerid = 264416
TargetTyrosine-protein kinase BTK(Homo sapiens (Human))
Tolero Pharmaceuticals
US Patent
LigandPNGBDBM264416(US9714247, 138)
Affinity DataIC50: <100nM. Assay description: A concentration of a drug that reduces the observed activity of an enzyme by 50%. An IC50 is not a true affinity constant and the specific value dete...
Ligand InfoPC cidPC sid
In DepthDetails US Patent
TargetTyrosine-protein kinase Lyn(Homo sapiens (Human))
Tolero Pharmaceuticals
US Patent
LigandPNGBDBM264416(US9714247, 138)
Affinity DataIC50: <100nM. Assay description: A concentration of a drug that reduces the observed activity of an enzyme by 50%. An IC50 is not a true affinity constant and the specific value dete...
Ligand InfoPC cidPC sid
In DepthDetails US Patent
TargetProto-oncogene tyrosine-protein kinase Src(Homo sapiens (Human))
Tolero Pharmaceuticals
US Patent
LigandPNGBDBM264416(US9714247, 138)
Affinity DataIC50: <100nM. Assay description: A concentration of a drug that reduces the observed activity of an enzyme by 50%. An IC50 is not a true affinity constant and the specific value dete...
Ligand InfoPC cidPC sid
In DepthDetails US Patent