BDBM264441 6-(4-chlorophenyl)-5-(1,5-dimethyl-6-oxo-1,6-dihydropyridin-3-yl)-3-methyl-5,6-dihydropyrrolo[3,4-c]pyrazol-4(2H)-one::US9714249, 9
SMILES Cc1[nH]nc2C(N(C(=O)c12)c1cc(C)c(=O)n(C)c1)c1ccc(Cl)cc1
InChI Key
Data  4 IC50
  Tab Delimited (TSV)   2D SDfile   Computed 3D by Vconf -m prep SDfile
Find this compound or compounds like it in BindingDB:
Activity Spreadsheet -- Enzyme Inhibition Constant Data from BindingDB
Found 4 hits for monomerid = 264441
TargetBromodomain-containing protein 4(Homo sapiens (Human))
Novartis
US Patent
LigandPNGBDBM264441(6-(4-chlorophenyl)-5-(1,5-dimethyl-6-oxo-1,6-dihyd...)
Affinity DataIC50:  90nMpH: 7.5Assay Description:All assays were performed in 384 well microtiter plates. Each assay plate contained 8-point serial dilutions for 40 test compounds, plus 16 high- and...
Ligand InfoPC cidPC sid
In DepthDetails US Patent
TargetCREB-binding protein(Homo sapiens (Human))
Novartis
US Patent
LigandPNGBDBM264441(6-(4-chlorophenyl)-5-(1,5-dimethyl-6-oxo-1,6-dihyd...)
Affinity DataIC50:  3.00E+3nMpH: 7.5 T: 2°C. Assay description: In order to assess bromodomain selectivity, we set up a binding assay using the bromodomain encoded by the CREBBP gene. Compounds were tested in the ...
Ligand InfoPC cidPC sid
In DepthDetails US Patent
TargetBromodomain-containing protein 3(Homo sapiens (Human))
Novartis
US Patent
LigandPNGBDBM264441(6-(4-chlorophenyl)-5-(1,5-dimethyl-6-oxo-1,6-dihyd...)
Affinity DataIC50:  67nMpH: 7.5Assay Description:All assays were performed in 384 well microtiter plates. Each assay plate contained 8-point serial dilutions for 40 test compounds, plus 16 high- and...
Ligand InfoPC cidPC sid
In DepthDetails US Patent
TargetBromodomain-containing protein 2(Homo sapiens (Human))
Novartis
US Patent
LigandPNGBDBM264441(6-(4-chlorophenyl)-5-(1,5-dimethyl-6-oxo-1,6-dihyd...)
Affinity DataIC50:  72nMpH: 7.5Assay Description:All assays were performed in 384 well microtiter plates. Each assay plate contained 8-point serial dilutions for 40 test compounds, plus 16 high- and...
Ligand InfoPC cidPC sid
In DepthDetails US Patent