BDBM26447 (2R)-2-{[6-(2-ethoxy-2-oxoethoxy)naphthalene-2-]sulfonamido}pentanedioic acid::naphthalene-N-sulfonyl-D-glu derivative, 17f
SMILES CCOC(=O)COc1ccc2cc(ccc2c1)S(=O)(=O)N[C@H](CCC(O)=O)C(O)=O
InChI Key InChIKey=RPHVNTQBEDVAPK-MRXNPFEDSA-N
Data  1 IC50
  Tab Delimited (TSV)   2D SDfile   Computed 3D by Vconf -m prep SDfile
Find this compound or compounds like it in BindingDB:
Activity Spreadsheet -- Enzyme Inhibition Constant Data from BindingDB
Found 1 hit for monomerid = 26447
TargetUDP-N-acetylmuramoylalanine--D-glutamate ligase(Escherichia coli (strain K12))
Lek Pharmaceuticals
LigandPNGBDBM26447((2R)-2-{[6-(2-ethoxy-2-oxoethoxy)naphthalene-2-]su...)
Affinity DataIC50:  1.92E+5nMpH: 8.6 T: 2°C. Assay description: The compounds were tested for their ability to inhibit the addition of D-[14C]Glu to UMA. The radioactive substrate and product were separated by re...
In DepthDetails ArticlePubMed