BDBM264481 US9714266, 10::methyl 17-(5-fluoropyridin-3-yl)-11a-hydroxyoestra-1,3,5(10),16-tetraene-3-carboxylate
SMILES [H][C@@]12CC=C(c3cncc(F)c3)[C@@]1(C)C[C@@H](O)[C@]1([H])c3ccc(cc3CC[C@@]21[H])C(=O)OC
InChI Key InChIKey=SROQHPPKIKIHDH-LBVSQVJBSA-N
Data  1 IC50
  Tab Delimited (TSV)   2D SDfile   Computed 3D by Vconf -m prep SDfile
Find this compound or compounds like it in BindingDB:
Activity Spreadsheet -- Enzyme Inhibition Constant Data from BindingDB
Found 1 hit for monomerid = 264481
TargetAldo-keto reductase family 1 member C3(Homo sapiens (Human))
Bayer Pharma Aktiengesellschaft
US Patent
LigandPNGBDBM264481(US9714266, 10 | methyl 17-(5-fluoropyridin-3-yl)-1...)
Affinity DataIC50:  97nMpH: 7.0Assay Description:For the assay, 50 nl of a 100-fold concentrated solution of the test substance in DMSO were pipetted into a black low-volume 384-well microtitre plat...
Ligand InfoPC cidPC sid
In DepthDetails US Patent