BDBM264512 17-(5-fluoropyridin-3-yl)-N-[2-(isopropylsulphonyl)ethyl]oestra-1,3,5(10),16-tetraene-3-carboxamide::US9714266, 42
SMILES CC(C)S(=O)(=O)CCNC(=O)c1ccc2[C@H]3CC[C@@]4(C)[C@@H](CC=C4c4cncc(F)c4)[C@@H]3CCc2c1
InChI Key InChIKey=NQEGOYUDDLRXCS-MCXWQWDOSA-N
Data  1 IC50
  Tab Delimited (TSV)   2D SDfile   Computed 3D by Vconf -m prep SDfile
Find this compound or compounds like it in BindingDB:
Activity Spreadsheet -- Enzyme Inhibition Constant Data from BindingDB
Found 1 hit for monomerid = 264512
TargetAldo-keto reductase family 1 member C3(Homo sapiens (Human))
Bayer Pharma Aktiengesellschaft
US Patent
LigandPNGBDBM264512(17-(5-fluoropyridin-3-yl)-N-[2-(isopropylsulphonyl...)
Affinity DataIC50:  11nMpH: 7.0Assay Description:For the assay, 50 nl of a 100-fold concentrated solution of the test substance in DMSO were pipetted into a black low-volume 384-well microtitre plat...
Ligand InfoPC cidPC sid
In DepthDetails US Patent