BDBM264544 US9718760, C328
SMILES CON(C)C(=O)C(=O)NCc1ccc(Cl)c(c1)C(F)(F)F
InChI Key InChIKey=ZUWCQEQHGOPFRU-UHFFFAOYSA-N
Data  3 IC50
  Tab Delimited (TSV)   2D SDfile   Computed 3D by Vconf -m prep SDfile
Find this compound or compounds like it in BindingDB:
Activity Spreadsheet -- Enzyme Inhibition Constant Data from BindingDB
Found 3 hits for monomerid = 264544
TargetPlasminogen activator inhibitor 1/Urokinase-type plasminogen activator(Homo sapiens (Human))
University Of Michigan
US Patent
LigandPNGBDBM264544(US9718760, C328)
Affinity DataIC50:  7.13E+5nMpH: 7.4 T: 2°C. Assay description: To determine the efficacy of various synthesized compounds as PAI-1 inhibitors, a fluorometric plate assay was carried out to measure the half maxima...
Ligand InfoPC cidPC sid
In DepthDetails US Patent
TargetPlasminogen activator inhibitor 1/Urokinase-type plasminogen activator(Homo sapiens (Human))
University Of Michigan
US Patent
LigandPNGBDBM264544(US9718760, C328)
Affinity DataIC50:  3.18E+5nMpH: 7.4 T: 2°C. Assay description: To determine the efficacy of various synthesized compounds as PAI-1 inhibitors, a fluorometric plate assay was carried out to measure the half maxima...
Ligand InfoPC cidPC sid
In DepthDetails US Patent
TargetPlasminogen activator inhibitor 1/Urokinase-type plasminogen activator(Homo sapiens (Human))
University Of Michigan
US Patent
LigandPNGBDBM264544(US9718760, C328)
Affinity DataIC50:  3.45E+5nMpH: 7.4 T: 2°C. Assay description: To determine the efficacy of various synthesized compounds as PAI-1 inhibitors, a fluorometric plate assay was carried out to measure the half maxima...
Ligand InfoPC cidPC sid
In DepthDetails US Patent