BDBM264617 US9718760, C170
SMILES CCCCCCCCN(CCCCCCCC)S(=O)(=O)c1ccc(O)c(O)c1
InChI Key InChIKey=JUUIYKQOXNFVDC-UHFFFAOYSA-N
Data  1 IC50
  Tab Delimited (TSV)   2D SDfile   Computed 3D by Vconf -m prep SDfile
Find this compound or compounds like it in BindingDB:
Activity Spreadsheet -- Enzyme Inhibition Constant Data from BindingDB
Found 1 hit for monomerid = 264617
TargetPlasminogen activator inhibitor 1/Urokinase-type plasminogen activator(Homo sapiens (Human))
University Of Michigan
US Patent
LigandPNGBDBM264617(US9718760, C170)
Affinity DataIC50:  5.49E+3nMpH: 7.4 T: 2°C. Assay description: To determine the efficacy of various synthesized compounds as PAI-1 inhibitors, a fluorometric plate assay was carried out to measure the half maxima...
Ligand InfoPC cidPC sid
In DepthDetails US Patent