BDBM264629 US9718760, C190
SMILES Oc1ccc(cc1O)S(=O)(=O)Nc1ccc(cc1)-c1cccc(F)c1
InChI Key InChIKey=DEIBHSFINBLDLJ-UHFFFAOYSA-N
Data  1 IC50
  Tab Delimited (TSV)   2D SDfile   Computed 3D by Vconf -m prep SDfile
Find this compound or compounds like it in BindingDB:
Activity Spreadsheet -- Enzyme Inhibition Constant Data from BindingDB
Found 1 hit for monomerid = 264629
TargetPlasminogen activator inhibitor 1/Urokinase-type plasminogen activator(Homo sapiens (Human))
University Of Michigan
US Patent
LigandPNGBDBM264629(US9718760, C190)
Affinity DataIC50:  9.70E+3nMpH: 7.4 T: 2°C. Assay description: To determine the efficacy of various synthesized compounds as PAI-1 inhibitors, a fluorometric plate assay was carried out to measure the half maxima...
Ligand InfoPC cidPC sid
In DepthDetails US Patent