BDBM26465 (2R)-2-[(5-butoxynaphthalene-1-)sulfonamido]pentanedioic acid::naphthylsulfonamide, 39
SMILES CCCCOc1cccc2c(cccc12)S(=O)(=O)N[C@H](CCC(O)=O)C(O)=O
InChI Key InChIKey=DVUVISAWFDCTQW-OAHLLOKOSA-N
Data  1 IC50
  Tab Delimited (TSV)   2D SDfile   Computed 3D by Vconf -m prep SDfile
Find this compound or compounds like it in BindingDB:
Activity Spreadsheet -- Enzyme Inhibition Constant Data from BindingDB
Found 1 hit for monomerid = 26465
TargetUDP-N-acetylmuramoylalanine--D-glutamate ligase(Escherichia coli (strain K12))
Lek Pharmaceuticals
LigandPNGBDBM26465((2R)-2-[(5-butoxynaphthalene-1-)sulfonamido]pentan...)
Affinity DataIC50: >1.00E+6nM. Assay description: The compounds were tested for their ability to inhibit the addition of D-[14C]Glu to UMA. The radioactive substrate and product were separated by re...
In DepthDetails ArticlePubMed