BDBM264674 US9718771, 2-9
SMILES CCN(Cc1cccc(CO)c1)c1cc(Cl)c(Cl)c(Cl)c1
InChI Key InChIKey=ADKQZRZUMAQWDY-UHFFFAOYSA-N
Data  1 IC50
  Tab Delimited (TSV)   2D SDfile   Computed 3D by Vconf -m prep SDfile
Find this compound or compounds like it in BindingDB:
Activity Spreadsheet -- Enzyme Inhibition Constant Data from BindingDB
Found 1 hit for monomerid = 264674
TargetSphingosine 1-phosphate receptor 1(Homo sapiens (Human))
Kissei Pharmaceutical
US Patent
LigandPNGBDBM264674(US9718771, 2-9)
Affinity DataIC50:  22.2nMpH: 7.4 T: 2°C. Assay description: Inhibitory activity evaluation was performed by multi-screen (registered trademark) HTS 96-well plate (Millipore) using the cell membrane fraction st...
Ligand InfoPC cidPC sid
In DepthDetails US Patent