BDBM264716 (R)-5-(4-(6-(2,3-dihydroxypropanoyl)pyridin-2-::US9718780, 3
SMILES OC[C@@H](O)C(=O)c1cccc(n1)-c1ccc(Oc2ccc(c(c2)C#N)C(F)(F)F)cc1
InChI Key InChIKey=QOIPLLIHRYLPJQ-HXUWFJFHSA-N
Data  1 IC50
  Tab Delimited (TSV)   2D SDfile   Computed 3D by Vconf -m prep SDfile
Find this compound or compounds like it in BindingDB:
Activity Spreadsheet -- Enzyme Inhibition Constant Data from BindingDB
Found 1 hit for monomerid = 264716
TargetSodium channel protein type 9 subunit alpha(Homo sapiens (Human))
TBA
US Patent
LigandPNGBDBM264716((R)-5-(4-(6-(2,3-dihydroxypropanoyl)pyridin-2- | U...)
Affinity DataIC50:  402nM. Assay description: In vitro assays were performed in a recombinant cell line expressing cDNA encoding the alpha subunit (Nav1.7, SCN9a, PN1, NE) of human Nav1.7 (Access...
Ligand InfoPC cidPC sid
In DepthDetails US Patent