BDBM26495 N-methyl-N-{2-methyl-5-[(6-phenylpyrimidin-4-yl)amino]phenyl}methanesulfonamide::aminopyrimidine, 16
SMILES CN(c1cc(Nc2cc(ncn2)-c2ccccc2)ccc1C)S(C)(=O)=O
InChI Key InChIKey=HTFPBBMPPXILKL-UHFFFAOYSA-N
Data  1 IC50
  Tab Delimited (TSV)   2D SDfile   Computed 3D by Vconf -m prep SDfile
Find this compound or compounds like it in BindingDB:
Activity Spreadsheet -- Enzyme Inhibition Constant Data from BindingDB
Found 1 hit for monomerid = 26495
TargetBeta-secretase 1(Homo sapiens (Human))
Merck Research Laboratories
LigandPNGBDBM26495(N-methyl-N-{2-methyl-5-[(6-phenylpyrimidin-4-yl)am...)
Affinity DataIC50: >1.60E+6nMpH: 4.5 T: 2°C. Assay description: The assay was performed using a 96-well format on a HPLC equipped with four 96-well plate holders. After the reaction was terminated, the solution wa...
In DepthDetails ArticlePubMed