BDBM265011 US9718792, 118
SMILES Cc1cc(cc(C)n1)-c1ccc(cc1F)C1=NO[C@@H](C[C@](C)(C(=O)NO)S(C)(=O)=O)C1
InChI Key InChIKey=QVAPILRXXSJVPD-IIBYNOLFSA-N
Data  1 IC50
  Tab Delimited (TSV)   2D SDfile   Computed 3D by Vconf -m prep SDfile
Find this compound or compounds like it in BindingDB:
Activity Spreadsheet -- Enzyme Inhibition Constant Data from BindingDB
Found 1 hit for monomerid = 265011
TargetUDP-3-O-acyl-N-acetylglucosamine deacetylase(Pseudomonas aeruginosa)
Novartis
US Patent
LigandPNGBDBM265011(US9718792, 118)
Affinity DataIC50:  0.00400nMpH: 7.5 T: 2°C. Assay description: The P. aeruginosa LpxC protein is produced according to the general method of Hyland et al (Journal of Bacteriology 1997 179, 2029-2037: Cloning, exp...
Ligand InfoPC cidPC sid
In DepthDetails US Patent