BDBM265047 US10413550, Example 11::US11234987, Example 11::US9718793, 11
SMILES CCc1cc(-c2oncc2-c2ccc(OC)c(OC)c2)c(O)cc1O
InChI Key InChIKey=ZLCFOBQTZPLCLK-UHFFFAOYSA-N
Data  3 IC50
  Tab Delimited (TSV)   2D SDfile   Computed 3D by Vconf -m prep SDfile
Find this compound or compounds like it in BindingDB:
Activity Spreadsheet -- Enzyme Inhibition Constant Data from BindingDB
Found 3 hits for monomerid = 265047
TargetHeat shock protein HSP 90-alpha(Homo sapiens (Human))
The Institute Of Cancer Research
US Patent
LigandPNGBDBM265047(US10413550, Example 11 | US11234987, Example 11 | ...)
Affinity DataIC50: <1.00E+4nM. Assay description: Chemicals are of the highest purity commercially available and all aqueous solutions are made up in AR water. Because of the need to minimise contami...
Ligand InfoPC cidPC sid
In DepthDetails US Patent
TargetATP-dependent molecular chaperone HSP82(Saccharomyces cerevisiae)
Cancer Research Technology
US Patent
LigandPNGBDBM265047(US10413550, Example 11 | US11234987, Example 11 | ...)
Affinity DataIC50: <5.00E+4nM. Assay description: 1. Dilute test compounds to 500 uM in AR water (DMSO concentration will be 2.5%). Transfer 2.5 ul of these compounds directly from the daughter plate...
Ligand InfoPC cidPC sid
In DepthDetails US Patent
TargetEndoplasmin/Heat shock protein 75/Heat shock protein HSP 90-alpha/Heat shock protein HSP 90-beta(Homo sapiens (Human))
The Institute Of Cancer Research
US Patent
LigandPNGBDBM265047(US10413550, Example 11 | US11234987, Example 11 | ...)
Affinity DataIC50: <1.00E+4nM. Assay description:  (1) Greiner 384-well (Greiner 781101) or Costar 384-well flat-bottomed polystyrene multiwell plates (VWR). (2) Assay buffer of (a) 100 mM Tris...
Ligand InfoPC cidPC sid
In DepthDetails US Patent