BDBM265089 US10413550, Example 30::US11234987, Example 30::US9718793, 30
SMILES CC(=O)Nc1cccc(c1)-c1c(C)noc1-c1cc(Cl)c(O)cc1O
InChI Key InChIKey=WQCHZMODCFYQHH-UHFFFAOYSA-N
Data  3 IC50
  Tab Delimited (TSV)   2D SDfile   Computed 3D by Vconf -m prep SDfile
Find this compound or compounds like it in BindingDB:
Activity Spreadsheet -- Enzyme Inhibition Constant Data from BindingDB
Found 3 hits for monomerid = 265089
TargetHeat shock protein HSP 90-alpha(Homo sapiens (Human))
The Institute Of Cancer Research
US Patent
LigandPNGBDBM265089(US10413550, Example 30 | US11234987, Example 30 | ...)
Affinity DataIC50: <1.00E+4nM. Assay description: Chemicals are of the highest purity commercially available and all aqueous solutions are made up in AR water. Because of the need to minimise contami...
Ligand InfoPC cidPC sid
In DepthDetails US Patent
TargetATP-dependent molecular chaperone HSP82(Saccharomyces cerevisiae)
Cancer Research Technology
US Patent
LigandPNGBDBM265089(US10413550, Example 30 | US11234987, Example 30 | ...)
Affinity DataIC50: <1.00E+4nM. Assay description: 1) Costar 96-well black assay plate. Assay buffer of (a) 100 mM Tris pH7.4; (b) 20 mM KCl; (c) 6 mM MgCl2. Stored at room temperature.3) BSA (bovine ...
Ligand InfoPC cidPC sid
In DepthDetails US Patent
TargetEndoplasmin/Heat shock protein 75/Heat shock protein HSP 90-alpha/Heat shock protein HSP 90-beta(Homo sapiens (Human))
The Institute Of Cancer Research
US Patent
LigandPNGBDBM265089(US10413550, Example 30 | US11234987, Example 30 | ...)
Affinity DataIC50: <1.00E+4nM. Assay description:  (1) Greiner 384-well (Greiner 781101) or Costar 384-well flat-bottomed polystyrene multiwell plates (VWR). (2) Assay buffer of (a) 100 mM Tris...
Ligand InfoPC cidPC sid
In DepthDetails US Patent