BDBM26509 N-[(2S,3R)-4-(cyclohexylamino)-3-hydroxy-1-phenylbutan-2-yl]-3-(1,1-dioxo-1,2-thiazinan-2-yl)-5-(ethylamino)benzamide::sultam hydroxyethylamine (HEA) derivative, 9d
SMILES CCNc1cc(cc(c1)C(=O)N[C@@H](Cc1ccccc1)[C@H](O)CNC1CCCCC1)N1CCCCS1(=O)=O
InChI Key InChIKey=PKMPPUBHPJPCRL-WUFINQPMSA-N
Data  3 IC50
  Tab Delimited (TSV)   2D SDfile   Computed 3D by Vconf -m prep SDfile
Find this compound or compounds like it in BindingDB:
Activity Spreadsheet -- Enzyme Inhibition Constant Data from BindingDB
Found 3 hits for monomerid = 26509
TargetBeta-secretase 1(Homo sapiens (Human))
Gsk
LigandPNGBDBM26509(N-[(2S,3R)-4-(cyclohexylamino)-3-hydroxy-1-phenylb...)
Affinity DataIC50:  69nMpH: 4.5 T: 2°C. Assay description: Enzyme activity and inhibition were assayed using a fluorescent FAM-[SEVNLDAEFK]-TAMRA substrate. Control reactions with no enzyme were included in e...
In DepthDetails ArticlePubMed
TargetCathepsin D(Homo sapiens (Human))
Gsk
LigandPNGBDBM26509(N-[(2S,3R)-4-(cyclohexylamino)-3-hydroxy-1-phenylb...)
Affinity DataIC50:  2.34E+3nM. Assay description: Enzyme activity and inhibition were assayed using a fluorescent FAM-[SEVNLDAEFK]-TAMRA substrate. Control reactions with no enzyme were included in e...
In DepthDetails ArticlePubMed
TargetBeta-secretase 2(Homo sapiens (Human))
Gsk
LigandPNGBDBM26509(N-[(2S,3R)-4-(cyclohexylamino)-3-hydroxy-1-phenylb...)
Affinity DataIC50:  4.37E+3nMpH: 4.5 T: 2°C. Assay description: Enzyme activity and inhibition were assayed using a fluorescent FAM-[SEVNLDAEFK]-TAMRA substrate. Control reactions with no enzyme were included in e...
In DepthDetails ArticlePubMed