BDBM265107 US9718808, 2
SMILES O=Cc1ccc(nc1)-n1cnnn1
InChI Key InChIKey=RYDGNVCYWURARU-UHFFFAOYSA-N
Data  1 IC50
  Tab Delimited (TSV)   2D SDfile   Computed 3D by Vconf -m prep SDfile
Find this compound or compounds like it in BindingDB:
Activity Spreadsheet -- Enzyme Inhibition Constant Data from BindingDB
Found 1 hit for monomerid = 265107
TargetATP-sensitive inward rectifier potassium channel 1(Homo sapiens (Human))
Merck Sharp & Dohme
US Patent
LigandPNGBDBM265107(US9718808, 2)
Affinity DataIC50:  44nM. Assay description: A Thallium Flux Assay was performed on each of the final product compounds of the Examples. This assay has been described previously; see, e.g., PCT ...
Ligand InfoPC cidPC sid
In DepthDetails US Patent