BDBM265652 US9718800, 7.0a
SMILES C[C@H](N(C)c1cc(F)cc(F)c1)c1cc(cc2c1oc(cc2=O)N1CCOCC1)C(=O)N(C)CCO
InChI Key InChIKey=HULWHZOGNQAZMZ-INIZCTEOSA-N
Data  1 IC50
  Tab Delimited (TSV)   2D SDfile   Computed 3D by Vconf -m prep SDfile
Find this compound or compounds like it in BindingDB:
Activity Spreadsheet -- Enzyme Inhibition Constant Data from BindingDB
Found 1 hit for monomerid = 265652
LigandPNGBDBM265652(US9718800, 7.0a)
Affinity DataIC50:  3.38E+3nMT: 2°C. Assay description: Compounds in 100% DMSO were added to assay plates by acoustic dispensing. PI3Kβ was added in a Tris buffer (50 mM Tris pH7.4, 0.05% CHAPS, 2.1 m...
Ligand InfoPC cidPC sid
In DepthDetails US Patent