BDBM265703 US9718790, I-0587
SMILES CC(C)Oc1ccc(cc1F)\N=c1/[nH]c(OCC(N)=O)nc(=O)n1Cc1ccc(Cl)cc1
InChI Key InChIKey=UCSHWYVKFUMEMW-UHFFFAOYSA-N
Data  1 IC50
  Tab Delimited (TSV)   2D SDfile   Computed 3D by Vconf -m prep SDfile
Find this compound or compounds like it in BindingDB:
Activity Spreadsheet -- Enzyme Inhibition Constant Data from BindingDB
Found 1 hit for monomerid = 265703
TargetP2X purinoceptor 3(Homo sapiens (Human))
Shionogi
US Patent
LigandPNGBDBM265703(US9718790, I-0587)
Affinity DataIC50:  299nMpH: 7.5Assay Description:Stably expressing cell line (C6BU-1 transfected with human P2X3 receptor gene (GenBank accession number Y07683) was used. The cells were seeded in a ...
Ligand InfoPC cidPC sid
In DepthDetails US Patent