BDBM266362 US9718790, I-1480
SMILES COC(=O)C1(Cn2c(=O)[nH]\c(=N/c3ccc(OC(C)C)c(C)c3)n(Cc3ccc(Cl)cc3)c2=O)COC1
InChI Key InChIKey=GKKBLNPCCNASIL-UHFFFAOYSA-N
Data  1 IC50
  Tab Delimited (TSV)   2D SDfile   Computed 3D by Vconf -m prep SDfile
Find this compound or compounds like it in BindingDB:
Activity Spreadsheet -- Enzyme Inhibition Constant Data from BindingDB
Found 1 hit for monomerid = 266362
TargetP2X purinoceptor 3(Homo sapiens (Human))
Shionogi
US Patent
LigandPNGBDBM266362(US9718790, I-1480)
Affinity DataIC50:  2nMpH: 7.5Assay Description:Stably expressing cell line (C6BU-1 transfected with human P2X3 receptor gene (GenBank accession number Y07683) was used. The cells were seeded in a ...
Ligand InfoPC cidPC sid
In DepthDetails US Patent