BDBM2667 (Alkylamino)piperidine BHAP Analog 35::1-[(5-Methanesulfonamidoindol-2-yl)carbonyl]-4-[N-ethyl-N-[3-[(1,1-dimethylethyl)amino]-6-fluoro-2-pyridinyl]amino]piperidine::N-{2-[(4-{[3-(tert-butylamino)-6-fluoropyridin-2-yl](ethyl)amino}piperidin-1-yl)carbonyl]-1H-indol-5-yl}methanesulfonamide
SMILES CCN(C1CCN(CC1)C(=O)c1cc2cc(NS(C)(=O)=O)ccc2[nH]1)c1nc(F)ccc1NC(C)(C)C
InChI Key InChIKey=XNOMYGHOMCIMHK-UHFFFAOYSA-N
Data  3 IC50
  Tab Delimited (TSV)   2D SDfile   Computed 3D by Vconf -m prep SDfile
Find this compound or compounds like it in BindingDB:
Activity Spreadsheet -- Enzyme Inhibition Constant Data from BindingDB
Found 3 hits for monomerid = 2667
TargetGag-Pol polyprotein [588-1027,P823L]/[588-1147,P823L](Human immunodeficiency virus type 1)
Upjohn
LigandPNGBDBM2667((Alkylamino)piperidine BHAP Analog 35 | 1-[(5-Meth...)
Affinity DataIC50:  1.05E+3nM. Assay description: The IC50 of reverse transcriptase is the concentration that inhibits 50% of recombinant HIV-1 RT RNA-directed DNA polymerase activity in vitro.
In DepthDetails ArticlePubMed
TargetGag-Pol polyprotein [588-1127,Y768C]/[588-1147,Y768C](Human immunodeficiency virus type 1)
Upjohn
LigandPNGBDBM2667((Alkylamino)piperidine BHAP Analog 35 | 1-[(5-Meth...)
Affinity DataIC50:  1.06E+3nM. Assay description: The IC50 of reverse transcriptase is the concentration that inhibits 50% of recombinant HIV-1 RT RNA-directed DNA polymerase activity in vitro.
In DepthDetails ArticlePubMed
TargetGag-Pol polyprotein [588-1027]/[588-1147](Human immunodeficiency virus type 1)
Upjohn
LigandPNGBDBM2667((Alkylamino)piperidine BHAP Analog 35 | 1-[(5-Meth...)
Affinity DataIC50:  730nM. Assay description: The IC50 of reverse transcriptase is the concentration that inhibits 50% of recombinant HIV-1 RT RNA-directed DNA polymerase activity in vitro.
In DepthDetails ArticlePubMed