BDBM266899 US9718790, I-2640
SMILES Cc1ccc(Cn2c(=O)n(CCCO)c(=O)[nH]\c2=N/c2ccc(Oc3cccc(n3)C#N)cc2)cc1
InChI Key InChIKey=RMROMRZXINTICU-UHFFFAOYSA-N
Data  1 IC50
  Tab Delimited (TSV)   2D SDfile   Computed 3D by Vconf -m prep SDfile
Find this compound or compounds like it in BindingDB:
Activity Spreadsheet -- Enzyme Inhibition Constant Data from BindingDB
Found 1 hit for monomerid = 266899
TargetP2X purinoceptor 3(Homo sapiens (Human))
Shionogi
US Patent
LigandPNGBDBM266899(US9718790, I-2640)
Affinity DataIC50:  2nMpH: 7.5Assay Description:Stably expressing cell line (C6BU-1 transfected with human P2X3 receptor gene (GenBank accession number Y07683) was used. The cells were seeded in a ...
Ligand InfoPC cidPC sid
In DepthDetails US Patent