BDBM267019 Methyl 2-hydroxy-4-({[2-methyl-5-(trifluoromethyl)furan-3-yl]sulfonyl}amino)benzoate::US9718809, 10
SMILES COC(=O)c1ccc(NS(=O)(=O)c2cc(oc2C)C(F)(F)F)cc1O
InChI Key InChIKey=UCYDPEOTXQDNSN-UHFFFAOYSA-N
Data  1 IC50
  Tab Delimited (TSV)   2D SDfile   Computed 3D by Vconf -m prep SDfile
Find this compound or compounds like it in BindingDB:
Activity Spreadsheet -- Enzyme Inhibition Constant Data from BindingDB
Found 1 hit for monomerid = 267019
Target6-phosphofructo-2-kinase/fructose-2,6-bisphosphatase 4(Homo sapiens (Human))
Kancera
US Patent
LigandPNGBDBM267019(Methyl 2-hydroxy-4-({[2-methyl-5-(trifluoromethyl)...)
Affinity DataIC50:  6.70E+3nM. Assay description: 6-phosphofructo-2-kinase/fructose-2,6-bisphosphatase (PFK-2/BPase-2) is a bi-functional enzyme that catalyses the formation and degradation of fructo...
Ligand InfoPC cidPC sid
In DepthDetails US Patent