BDBM267032 1-Methylethyl 3'-{[3-hydroxy-4-(methoxycarbonyl)phenyl]sulfamoyl}biphenyl-3-carboxylate::US9718809, 128
SMILES COC(=O)c1ccc(NS(=O)(=O)c2cccc(c2)-c2cccc(c2)C(=O)OC(C)C)cc1O
InChI Key InChIKey=CIWGIWIELKWLFA-UHFFFAOYSA-N
Data  1 IC50
  Tab Delimited (TSV)   2D SDfile   Computed 3D by Vconf -m prep SDfile
Find this compound or compounds like it in BindingDB:
Activity Spreadsheet -- Enzyme Inhibition Constant Data from BindingDB
Found 1 hit for monomerid = 267032
Target6-phosphofructo-2-kinase/fructose-2,6-bisphosphatase 4(Homo sapiens (Human))
Kancera
US Patent
LigandPNGBDBM267032(1-Methylethyl 3'-{[3-hydroxy-4-(methoxycarbonyl)ph...)
Affinity DataIC50:  1.33E+4nM. Assay description: 6-phosphofructo-2-kinase/fructose-2,6-bisphosphatase (PFK-2/BPase-2) is a bi-functional enzyme that catalyses the formation and degradation of fructo...
Ligand InfoPC cidPC sid
In DepthDetails US Patent