BDBM267058 2-Ethoxyethyl 4-{[(2,5-dichloro-3-thienyl)sulfonyl]amino}-2-hydroxybenzoate::US9718809, 66
SMILES CCOCCOC(=O)c1ccc(NS(=O)(=O)c2cc(Cl)sc2Cl)cc1O
InChI Key InChIKey=GSIZAJUYWHOVLW-UHFFFAOYSA-N
Data  1 IC50
  Tab Delimited (TSV)   2D SDfile   Computed 3D by Vconf -m prep SDfile
Find this compound or compounds like it in BindingDB:
Activity Spreadsheet -- Enzyme Inhibition Constant Data from BindingDB
Found 1 hit for monomerid = 267058
Target6-phosphofructo-2-kinase/fructose-2,6-bisphosphatase 4(Homo sapiens (Human))
Kancera
US Patent
LigandPNGBDBM267058(2-Ethoxyethyl 4-{[(2,5-dichloro-3-thienyl)sulfonyl...)
Affinity DataIC50:  5.70E+3nM. Assay description: 6-phosphofructo-2-kinase/fructose-2,6-bisphosphatase (PFK-2/BPase-2) is a bi-functional enzyme that catalyses the formation and degradation of fructo...
Ligand InfoPC cidPC sid
In DepthDetails US Patent