BDBM267228 3-chloro-5-((6-oxo-1-((3-oxo-2,3-dihydropyridazin-4-yl)methyl)-4-(trifluoromethyl)-1,6-dihydropyrimidin-5-yl)oxy)benzonitrile::US9718819, 5
SMILES FC(F)(F)c1ncn(Cc2ccn[nH]c2=O)c(=O)c1Oc1cc(Cl)cc(c1)C#N
InChI Key InChIKey=OAVDEQWXYJJZLE-UHFFFAOYSA-N
Data  1 IC50
  Tab Delimited (TSV)   2D SDfile   Computed 3D by Vconf -m prep SDfile
Find this compound or compounds like it in BindingDB:
Activity Spreadsheet -- Enzyme Inhibition Constant Data from BindingDB
Found 1 hit for monomerid = 267228
TargetGag-Pol polyprotein(Human immunodeficiency virus type 1 group M subtyp...)
Merck Sharp & Dohme
US Patent
LigandPNGBDBM267228(3-chloro-5-((6-oxo-1-((3-oxo-2,3-dihydropyridazin-...)
Affinity DataIC50:  6nMpH: 7.8 T: 2°C. Assay description: The heterodimeric nucleic acid substrate used in the HIV-1 RT polymerase reactions was generated by annealing the DNA primer, biotinylated pD500 (Sig...
Ligand InfoPC cidPC sid
In DepthDetails US Patent