BDBM267284 3-chloro-5-((1-((5-(3- fluoro-5- methoxyphenyl)-6- oxo-1,6- dihydropyridazin-3- yl)methyl)-6-oxo-4- (trifluoromethyl)-1,6- dihydropyrimidin-5- yl)oxy)benzonitrile::US10189831, Example 61::US9718819, 61
SMILES COc1cc(F)cc(c1)-c1cc(Cn2cnc(c(Oc3cc(Cl)cc(c3)C#N)c2=O)C(F)(F)F)n[nH]c1=O
InChI Key InChIKey=RXNLDVRVAALXKU-UHFFFAOYSA-N
Data  2 IC50
  Tab Delimited (TSV)   2D SDfile   Computed 3D by Vconf -m prep SDfile
Find this compound or compounds like it in BindingDB:
Activity Spreadsheet -- Enzyme Inhibition Constant Data from BindingDB
Found 2 hits for monomerid = 267284
TargetGag-Pol polyprotein(Human immunodeficiency virus type 1 group M subtyp...)
Merck Sharp & Dohme
US Patent
LigandPNGBDBM267284(3-chloro-5-((1-((5-(3- fluoro-5- methoxyphenyl)-6-...)
Affinity DataIC50:  11nM. Assay description: The heterodimeric nucleic acid substrate used in the HIV-1 RT polymerase reactions was generated by annealing the DNA primer, biotinylated pD500 (Sig...
Ligand InfoPC cidPC sid
In DepthDetails US Patent
TargetGag-Pol polyprotein(Human immunodeficiency virus type 1 group M subtyp...)
Merck Sharp & Dohme
US Patent
LigandPNGBDBM267284(3-chloro-5-((1-((5-(3- fluoro-5- methoxyphenyl)-6-...)
Affinity DataIC50:  11nMpH: 7.8 T: 2°C. Assay description: The heterodimeric nucleic acid substrate used in the HIV-1 RT polymerase reactions was generated by annealing the DNA primer, biotinylated pD500 (Sig...
Ligand InfoPC cidPC sid
In DepthDetails US Patent