BDBM267388 5-fluoro-2-methyl-3-(6-oxo-1-((6-oxo-1,6-dihydropyridazin-3-yl)methyl)-4-(trifluoro methyl)-1,6-dihydropyrimidin-5-yloxy)benzonitrile::US10189831, Example 164::US9718819, 164
SMILES Cc1c(Oc2c(ncn(Cc3ccc(=O)[nH]n3)c2=O)C(F)(F)F)cc(F)cc1C#N
InChI Key InChIKey=QJCPWLXYTYEYPW-UHFFFAOYSA-N
Data  2 IC50
  Tab Delimited (TSV)   2D SDfile   Computed 3D by Vconf -m prep SDfile
Find this compound or compounds like it in BindingDB:
Activity Spreadsheet -- Enzyme Inhibition Constant Data from BindingDB
Found 2 hits for monomerid = 267388
TargetGag-Pol polyprotein(Human immunodeficiency virus type 1 group M subtyp...)
Merck Sharp & Dohme
US Patent
LigandPNGBDBM267388(5-fluoro-2-methyl-3-(6-oxo-1-((6-oxo-1,6-dihydropy...)
Affinity DataIC50:  7nM. Assay description: The heterodimeric nucleic acid substrate used in the HIV-1 RT polymerase reactions was generated by annealing the DNA primer, biotinylated pD500 (Sig...
Ligand InfoPC cidPC sid
In DepthDetails US Patent
TargetGag-Pol polyprotein(Human immunodeficiency virus type 1 group M subtyp...)
Merck Sharp & Dohme
US Patent
LigandPNGBDBM267388(5-fluoro-2-methyl-3-(6-oxo-1-((6-oxo-1,6-dihydropy...)
Affinity DataIC50:  7nMpH: 7.8 T: 2°C. Assay description: The heterodimeric nucleic acid substrate used in the HIV-1 RT polymerase reactions was generated by annealing the DNA primer, biotinylated pD500 (Sig...
Ligand InfoPC cidPC sid
In DepthDetails US Patent