BDBM267408 2-(3-tert-Butyl-isoxazol-5-yl)-4-methoxy-6-(2-trifluoromethyl-phenyl)-3H-imidazo[4,5-c]-pyridine sodium salt ::US9718820, Compound 8
SMILES COc1nc(cc2nc(-c3cc(no3)C(C)(C)C)n([Na])c12)-c1ccccc1C(F)(F)F
InChI Key InChIKey=WJBWFDGKMQIHEO-UHFFFAOYSA-N
Data  1 IC50
  Tab Delimited (TSV)   2D SDfile   Computed 3D by Vconf -m prep SDfile
Find this compound or compounds like it in BindingDB:
Activity Spreadsheet -- Enzyme Inhibition Constant Data from BindingDB
Found 1 hit for monomerid = 267408
TargetTransient receptor potential M8 protein(Canis lupus familiaris (Dog))
Janssen Pharmaceutica
US Patent
LigandPNGBDBM267408(2-(3-tert-Butyl-isoxazol-5-yl)-4-methoxy-6-(2-trif...)
Affinity DataIC50:  6nMT: 2°C. Assay description: HEK293 cells stably expressing canine TRPM8 were routinely grown as monolayers in Dulbecco's minimum essential medium supplemented with 10% FBS, ...
Ligand InfoPC cidPC sid
In DepthDetails US Patent