BDBM267422 3-tert-Butyl-1-methyl-5-[4-piperidin-1-yl-6-(2-trifluoromethyl-phenyl)- 3H-imidazo[4,5-c]pyridine-2-yl]-1H-pyrazole-4-carbonitrile::US9718820, Compound 22
SMILES Cn1nc(c(C#N)c1-c1nc2cc(nc(N3CCNCC3)c2[nH]1)-c1ccccc1C(F)(F)F)C(C)(C)C
InChI Key InChIKey=WLXDGMKDDMPWFX-UHFFFAOYSA-N
Data  1 IC50
  Tab Delimited (TSV)   2D SDfile   Computed 3D by Vconf -m prep SDfile
Find this compound or compounds like it in BindingDB:
Activity Spreadsheet -- Enzyme Inhibition Constant Data from BindingDB
Found 1 hit for monomerid = 267422
TargetTransient receptor potential M8 protein(Canis lupus familiaris (Dog))
Janssen Pharmaceutica
US Patent
LigandPNGBDBM267422(3-tert-Butyl-1-methyl-5-[4-piperidin-1-yl-6-(2-tri...)
Affinity DataIC50:  1.40nMT: 2°C. Assay description: HEK293 cells stably expressing canine TRPM8 were routinely grown as monolayers in Dulbecco's minimum essential medium supplemented with 10% FBS, ...
Ligand InfoPC cidPC sid
In DepthDetails US Patent