BDBM267450 US9718822, 33::US9750744, Example 33::US9902741, Example 33
SMILES CC1CCc2ncc(F)cc2[C@H]2CCCN2c2ccn3ncc(C(=O)N1)c3n2
InChI Key InChIKey=OEBIHOVSAMBXIB-RGUGMKFQSA-N
Data  3 IC50
  Tab Delimited (TSV)   2D SDfile   Computed 3D by Vconf -m prep SDfile
Find this compound or compounds like it in BindingDB:
Activity Spreadsheet -- Enzyme Inhibition Constant Data from BindingDB
Found 3 hits for monomerid = 267450
TargetHigh affinity nerve growth factor receptor(Homo sapiens (Human))
Array Biopharma
US Patent
LigandPNGBDBM267450(US9718822, 33 | US9750744, Example 33 | US9902741,...)
Affinity DataIC50:  55nMpH: 7.5Assay Description:The ability of a compound to bind to TrkA was measured by Invitrogen's LanthaScreen¿ Eu Kinase Binding Assay. In this assay, His-tagged recombina...
In DepthDetails US Patent
TargetHigh affinity nerve growth factor receptor(Homo sapiens (Human))
Array Biopharma
US Patent
LigandPNGBDBM267450(US9718822, 33 | US9750744, Example 33 | US9902741,...)
Affinity DataIC50:  55nM. Assay description: The ability of a compound to bind to TrkA was measured by Invitrogen's LanthaScreen™ Eu Kinase Binding Assay. In this assay, His-tagged recombina...
In DepthDetails US Patent
TargetHigh affinity nerve growth factor receptor(Homo sapiens (Human))
Array Biopharma
US Patent
LigandPNGBDBM267450(US9718822, 33 | US9750744, Example 33 | US9902741,...)
Affinity DataIC50:  55nM. Assay description: The ability of a compound to bind to TrkA was measured by Invitrogen's LanthaScreen Eu Kinase Binding Assay. In this assay, His-tagged recombinan...
In DepthDetails US Patent