BDBM267453 US10688100, Compound 36::US10966985, Compound 36::US9718822, 36::US9750744, Example 36::US9902741, Example 36
SMILES CC1(C)CNC(=O)c2cnn3ccc(nc23)N2CCC[C@@H]2c2cc(F)cnc2OC1
InChI Key InChIKey=LTTXNEAUXULKJC-MRXNPFEDSA-N
Data  11 IC50
  Tab Delimited (TSV)   2D SDfile   Computed 3D by Vconf -m prep SDfile
Find this compound or compounds like it in BindingDB:
Activity Spreadsheet -- Enzyme Inhibition Constant Data from BindingDB
Found 11 hits for monomerid = 267453
TargetHigh affinity nerve growth factor receptor(Homo sapiens (Human))
Array Biopharma
US Patent
LigandPNGBDBM267453(US10688100, Compound 36 | US10966985, Compound 36 ...)
Affinity DataIC50:  55nMpH: 7.5Assay Description:The ability of a compound to bind to TrkA was measured by Invitrogen's LanthaScreen¿ Eu Kinase Binding Assay. In this assay, His-tagged recombina...
Ligand InfoPC cidPC sid
In DepthDetails US Patent
TargetHigh affinity nerve growth factor receptor(Homo sapiens (Human))
Array Biopharma
US Patent
LigandPNGBDBM267453(US10688100, Compound 36 | US10966985, Compound 36 ...)
Affinity DataIC50:  55nM. Assay description: The ability of a compound to bind to TrkA was measured by Invitrogen's LanthaScreen Eu Kinase Binding Assay. In this assay, His-tagged recombinan...
Ligand InfoPC cidPC sid
In DepthDetails US Patent
TargetHigh affinity nerve growth factor receptor(Homo sapiens (Human))
Array Biopharma
US Patent
LigandPNGBDBM267453(US10688100, Compound 36 | US10966985, Compound 36 ...)
Affinity DataIC50:  55nM. Assay description: The ability of a compound to bind to TrkA was measured by Invitrogen's LanthaScreen™ Eu Kinase Binding Assay. In this assay, His-tagged recombina...
Ligand InfoPC cidPC sid
In DepthDetails US Patent
TargetProto-oncogene tyrosine-protein kinase ROS(Homo sapiens (Human))
Array Biopharma
US Patent
LigandPNGBDBM267453(US10688100, Compound 36 | US10966985, Compound 36 ...)
Affinity DataIC50:  0.700nM. Assay description: The potency of a compound inhibiting wild type and exemplary mutant ROS1 kinases was determined using CisBio's HTRF Kinease-TK assay technology. ...
Ligand InfoPC cidPC sid
In DepthDetails US Patent
TargetProto-oncogene tyrosine-protein kinase ROS [L2026M](Homo sapiens (Human))
Array Biopharma
US Patent
LigandPNGBDBM267453(US10688100, Compound 36 | US10966985, Compound 36 ...)
Affinity DataIC50:  6.5nM. Assay description: The potency of a compound inhibiting wild type and exemplary mutant ROS1 kinases was determined using CisBio's HTRF Kinease-TK assay technology. ...
Ligand InfoPC cidPC sid
In DepthDetails US Patent
TargetProto-oncogene tyrosine-protein kinase ROS [D2033N](Homo sapiens (Human))
Array Biopharma
US Patent
LigandPNGBDBM267453(US10688100, Compound 36 | US10966985, Compound 36 ...)
Affinity DataIC50:  0.200nM. Assay description: The potency of a compound inhibiting wild type and exemplary mutant ROS1 kinases was determined using CisBio's HTRF Kinease-TK assay technology. ...
Ligand InfoPC cidPC sid
In DepthDetails US Patent
TargetProto-oncogene tyrosine-protein kinase ROS [G2032R](Homo sapiens (Human))
Array Biopharma
US Patent
LigandPNGBDBM267453(US10688100, Compound 36 | US10966985, Compound 36 ...)
Affinity DataIC50:  0.200nM. Assay description: The potency of a compound inhibiting wild type and exemplary mutant ROS1 kinases was determined using CisBio's HTRF Kinease-TK assay technology. ...
Ligand InfoPC cidPC sid
In DepthDetails US Patent
TargetProto-oncogene tyrosine-protein kinase ROS(Homo sapiens (Human))
Array Biopharma
US Patent
LigandPNGBDBM267453(US10688100, Compound 36 | US10966985, Compound 36 ...)
Affinity DataIC50:  0.700nM. Assay description: The potency of a compound inhibiting wild type and exemplary mutant ROS1 kinases was determined using CisBio's HTRF Kinease-TK assay technology. ...
Ligand InfoPC cidPC sid
In DepthDetails US Patent
TargetProto-oncogene tyrosine-protein kinase ROS [G2032R](Homo sapiens (Human))
Array Biopharma
US Patent
LigandPNGBDBM267453(US10688100, Compound 36 | US10966985, Compound 36 ...)
Affinity DataIC50:  6.5nM. Assay description: The potency of a compound inhibiting wild type and exemplary mutant ROS1 kinases was determined using CisBio's HTRF Kinease-TK assay technology. ...
Ligand InfoPC cidPC sid
In DepthDetails US Patent
TargetProto-oncogene tyrosine-protein kinase ROS [L2026M](Homo sapiens (Human))
Array Biopharma
US Patent
LigandPNGBDBM267453(US10688100, Compound 36 | US10966985, Compound 36 ...)
Affinity DataIC50:  0.5nM. Assay description: The potency of a compound inhibiting wild type and exemplary mutant ROS1 kinases was determined using CisBio's HTRF Kinease-TK assay technology. ...
Ligand InfoPC cidPC sid
In DepthDetails US Patent
TargetProto-oncogene tyrosine-protein kinase ROS [D2033N](Homo sapiens (Human))
Array Biopharma
US Patent
LigandPNGBDBM267453(US10688100, Compound 36 | US10966985, Compound 36 ...)
Affinity DataIC50:  0.5nM. Assay description: The potency of a compound inhibiting wild type and exemplary mutant ROS1 kinases was determined using CisBio's HTRF Kinease-TK assay technology. ...
Ligand InfoPC cidPC sid
In DepthDetails US Patent