BDBM267457 US9718822, 38::US9750744, Example 38::US9902741, Example 38
SMILES Fc1cnc2OCCn3nccc3NC(=O)c3cnn4ccc(nc34)N3CCC[C@@H]3c2c1
InChI Key InChIKey=ATHHGWSYXBLXOA-MRXNPFEDSA-N
Data  3 IC50
  Tab Delimited (TSV)   2D SDfile   Computed 3D by Vconf -m prep SDfile
Find this compound or compounds like it in BindingDB:
Activity Spreadsheet -- Enzyme Inhibition Constant Data from BindingDB
Found 3 hits for monomerid = 267457
TargetHigh affinity nerve growth factor receptor(Homo sapiens (Human))
Array Biopharma
US Patent
LigandPNGBDBM267457(US9718822, 38 | US9750744, Example 38 | US9902741,...)
Affinity DataIC50:  55nMpH: 7.5Assay Description:The ability of a compound to bind to TrkA was measured by Invitrogen's LanthaScreen¿ Eu Kinase Binding Assay. In this assay, His-tagged recombina...
Ligand InfoPC cidPC sid
In DepthDetails US Patent
TargetHigh affinity nerve growth factor receptor(Homo sapiens (Human))
Array Biopharma
US Patent
LigandPNGBDBM267457(US9718822, 38 | US9750744, Example 38 | US9902741,...)
Affinity DataIC50:  55nM. Assay description: The ability of a compound to bind to TrkA was measured by Invitrogen's LanthaScreen™ Eu Kinase Binding Assay. In this assay, His-tagged recombina...
Ligand InfoPC cidPC sid
In DepthDetails US Patent
TargetHigh affinity nerve growth factor receptor(Homo sapiens (Human))
Array Biopharma
US Patent
LigandPNGBDBM267457(US9718822, 38 | US9750744, Example 38 | US9902741,...)
Affinity DataIC50:  55nM. Assay description: The ability of a compound to bind to TrkA was measured by Invitrogen's LanthaScreen Eu Kinase Binding Assay. In this assay, His-tagged recombinan...
Ligand InfoPC cidPC sid
In DepthDetails US Patent