BDBM26761 2-fluorophenyl N-[2-methyl-8-(2-methyl-4,5-diphenyl-1H-imidazol-1-yl)octan-3-yl]carbamate::D, L mixtures::bisarylimidazole derivative, 20
SMILES CC(C)C(CCCCCn1c(C)nc(c1-c1ccccc1)-c1ccccc1)NC(=O)Oc1ccccc1F
InChI Key InChIKey=HMJCRVRGZFQOMD-UHFFFAOYSA-N
Data  1 IC50
  Tab Delimited (TSV)   2D SDfile   Computed 3D by Vconf -m prep SDfile
Find this compound or compounds like it in BindingDB:
Activity Spreadsheet -- Enzyme Inhibition Constant Data from BindingDB
Found 1 hit for monomerid = 26761
TargetFatty-acid amide hydrolase 1(Homo sapiens (Human))
Bristol-Myers Squibb
LigandPNGBDBM26761(2-fluorophenyl N-[2-methyl-8-(2-methyl-4,5-dipheny...)
Affinity DataIC50:  250nMpH: 9.0 T: 2°C. Assay description: FAAH Inhibition Assay [3H]Ethanolamine produced from [3H]AEA hydrolysis was used to calculate FAAH activity and was measured by scintillation countin...
In DepthDetails ArticlePubMed