BDBM267768 4-(8-amino-3-{(3R)-1-[(3-methyloxetan-3-yl)carbonyl]piperidin-3-yl}imidazo[1,5-a]pyrazin-1-yl)-N-isothiazol-4-ylbenzamide::US9718828, Example, 371
SMILES CCc1ccnc(NC(=O)c2ccc(cc2)-c2nc([C@@H]3CCCN(C3)C(=O)C3(O)CC3)n3ccnc(N)c23)c1
InChI Key InChIKey=BLODPKXFDWIUIY-OAQYLSRUSA-N
Data  1 IC50
  Tab Delimited (TSV)   2D SDfile   Computed 3D by Vconf -m prep SDfile
Find this compound or compounds like it in BindingDB:
Activity Spreadsheet -- Enzyme Inhibition Constant Data from BindingDB
Found 1 hit for monomerid = 267768
TargetTyrosine-protein kinase BTK(Homo sapiens (Human))
Merck Sharp & Dohme
US Patent
LigandPNGBDBM267768(4-(8-amino-3-{(3R)-1-[(3-methyloxetan-3-yl)carbony...)
Affinity DataIC50: <10nM. Assay description: BTK enzymatic activity was determined with the LANCE (Lanthanide Chelate Excite) TR-FRET (Time-resolved fluorescence resonance energy transfer) assay...
Ligand InfoPC cidPC sid
In DepthDetails US Patent