BDBM267928 4-(8-amino-3-{(2R)-4-[(2S)-2-hydroxypropanoyl]morpholin-2-yl}-5-methylimidazo[1,5-a]pyrazin-1-yl)-N-[4-(trifluoromethyl)pyridin-2-yl]benzamide::US9718828, Example, 544
SMILES C[C@@H](O)C(=O)N1CCO[C@H](C1)c1nc(-c2ccc(cc2)C(=O)Nc2cc(ccn2)C(F)(F)F)c2c(N)ncc(C)n12
InChI Key InChIKey=FZDZOMGNAHTHMA-DNVCBOLYSA-N
Data  1 IC50
  Tab Delimited (TSV)   2D SDfile   Computed 3D by Vconf -m prep SDfile
Find this compound or compounds like it in BindingDB:
Activity Spreadsheet -- Enzyme Inhibition Constant Data from BindingDB
Found 1 hit for monomerid = 267928
TargetTyrosine-protein kinase BTK(Homo sapiens (Human))
Merck Sharp & Dohme
US Patent
LigandPNGBDBM267928(4-(8-amino-3-{(2R)-4-[(2S)-2-hydroxypropanoyl]morp...)
Affinity DataIC50: <10nM. Assay description: BTK enzymatic activity was determined with the LANCE (Lanthanide Chelate Excite) TR-FRET (Time-resolved fluorescence resonance energy transfer) assay...
Ligand InfoPC cidPC sid
In DepthDetails US Patent