BDBM26793 benzimidazole analog., 19::tert-butyl (3S,4S)-3-(hydroxycarbamoyl)-4-[(4-{[2-(propan-2-yl)-1H-1,3-benzodiazol-1-yl]methyl}benzene)amido]pyrrolidine-1-carboxylate
SMILES CC(C)c1nc2ccccc2n1Cc1ccc(cc1)C(=O)N[C@@H]1CN(C[C@@H]1C(=O)NO)C(=O)OC(C)(C)C
InChI Key InChIKey=HWRTYSUSQVJAGF-RBBKRZOGSA-N
Data  4 KI  3 IC50
  Tab Delimited (TSV)   2D SDfile   Computed 3D by Vconf -m prep SDfile
Find this compound or compounds like it in BindingDB:
Activity Spreadsheet -- Enzyme Inhibition Constant Data from BindingDB
Found 7 hits for monomerid = 26793
TargetNeutrophil collagenase(Homo sapiens (Human))
Bristol-Myers Squibb
LigandPNGBDBM26793(benzimidazole analog., 19 | tert-butyl (3S,4S)-3-(...)
Affinity DataKi: >3.06E+3nM. Assay description: The compounds were tested for enzyme inhibition using fluorescence resonance energy transfer (FRET) assay. Fluorescence measurements were performed i...
In DepthDetails ArticlePubMed
TargetMatrilysin(Homo sapiens (Human))
Bristol-Myers Squibb
LigandPNGBDBM26793(benzimidazole analog., 19 | tert-butyl (3S,4S)-3-(...)
Affinity DataKi:  3.50E+3nM ΔG°:  -7.44kcal/molepH: 7.5 T: 2°C. Assay description: The compounds were tested for enzyme inhibition using fluorescence resonance energy transfer (FRET) assay. Fluorescence measurements were performed i...
In DepthDetails ArticlePubMed
TargetStromelysin-1(Homo sapiens (Human))
Bristol-Myers Squibb
LigandPNGBDBM26793(benzimidazole analog., 19 | tert-butyl (3S,4S)-3-(...)
Affinity DataKi:  3.92E+3nM ΔG°:  -7.37kcal/molepH: 7.5 T: 2°C. Assay description: The compounds were tested for enzyme inhibition using fluorescence resonance energy transfer (FRET) assay. Fluorescence measurements were performed i...
In DepthDetails ArticlePubMed
TargetCollagenase 3(Homo sapiens (Human))
Bristol-Myers Squibb
LigandPNGBDBM26793(benzimidazole analog., 19 | tert-butyl (3S,4S)-3-(...)
Affinity DataKi: >5.03E+3nM. Assay description: The compounds were tested for enzyme inhibition using fluorescence resonance energy transfer (FRET) assay. Fluorescence measurements were performed i...
In DepthDetails ArticlePubMed
TargetStromelysin-2(Homo sapiens (Human))
Bristol-Myers Squibb
LigandPNGBDBM26793(benzimidazole analog., 19 | tert-butyl (3S,4S)-3-(...)
Affinity DataIC50:  4.60E+3nM. Assay description: The compounds were tested for enzyme inhibition using fluorescence resonance energy transfer (FRET) assay. Fluorescence measurements were performed i...
In DepthDetails ArticlePubMed
TargetDisintegrin and metalloproteinase domain-containing protein 17(Sus scrofa (pig))
Bristol-Myers Squibb
LigandPNGBDBM26793(benzimidazole analog., 19 | tert-butyl (3S,4S)-3-(...)
Affinity DataIC50:  1nMpH: 7.5 T: 2°C. Assay description: The compounds were tested for enzyme inhibition using fluorescence resonance energy transfer (FRET) assay. Fluorescence measurements were performed i...
In DepthDetails ArticlePubMed
TargetMacrophage metalloelastase(Homo sapiens (Human))
Bristol-Myers Squibb
LigandPNGBDBM26793(benzimidazole analog., 19 | tert-butyl (3S,4S)-3-(...)
Affinity DataIC50:  390nMpH: 7.5 T: 2°C. Assay description: The compounds were tested for enzyme inhibition using fluorescence resonance energy transfer (FRET) assay. Fluorescence measurements were performed i...
In DepthDetails ArticlePubMed