BDBM268415 2,3-difluoro-4-[3-[2- (trifluoromethyl)benzoyl]imidazo [1,5-a]pyridin-1-yl]benzoic acid::US9550771, Example 14
SMILES OC(=O)c1ccc(-c2nc(C(=O)c3ccccc3C(F)(F)F)n3ccccc23)c(F)c1F
InChI Key InChIKey=INYJYMAFIREOFB-UHFFFAOYSA-N
Data  1 EC50
  Tab Delimited (TSV)   2D SDfile   Computed 3D by Vconf -m prep SDfile
Find this compound or compounds like it in BindingDB:
Activity Spreadsheet -- Enzyme Inhibition Constant Data from BindingDB
Found 1 hit for monomerid = 268415
TargetNuclear receptor ROR-gamma [262-507](Homo sapiens (Human))
Genentech
US Patent
LigandPNGBDBM268415(2,3-difluoro-4-[3-[2- (trifluoromethyl)benzoyl]imi...)
Affinity DataEC50:  358nMT: 2°C. Assay description: ssays were carried out in 16-μL reaction volumes in black 384 Plus F Proxiplates (Perkin-Elmer 6008269). All assay components except test ligand...
Ligand InfoPC cidPC sid
In DepthDetails US Patent