BDBM268424 4-[3-[2-chloro-6- (trifluoromethyl)benzoyl]-5,6,7,8- tetrahydroimidazo[1,5-a]pyridin- 1-yl]-2-fluoro-benzoic acid::US9550771, Example 23
SMILES OC(=O)c1ccc(cc1F)-c1nc(C(=O)c2c(Cl)cccc2C(F)(F)F)n2CCCCc12
InChI Key InChIKey=GKOMLTNKESYVSN-UHFFFAOYSA-N
Data  1 EC50
  Tab Delimited (TSV)   2D SDfile   Computed 3D by Vconf -m prep SDfile
Find this compound or compounds like it in BindingDB:
Activity Spreadsheet -- Enzyme Inhibition Constant Data from BindingDB
Found 1 hit for monomerid = 268424
TargetNuclear receptor ROR-gamma [262-507](Homo sapiens (Human))
Genentech
US Patent
LigandPNGBDBM268424(4-[3-[2-chloro-6- (trifluoromethyl)benzoyl]-5,6,7,...)
Affinity DataEC50:  205nMT: 2°C. Assay description: ssays were carried out in 16-μL reaction volumes in black 384 Plus F Proxiplates (Perkin-Elmer 6008269). All assay components except test ligand...
Ligand InfoPC cidPC sid
In DepthDetails US Patent