BDBM268477 7-[3-[2-chloro-6- (trifluoromethyl)benzoyl]-5,6,7,8- tetrahydroimidazo[1,5-a]pyridin- 1-yl]-4-hydroxy-chromen-2-one::US9550771, Example 76
SMILES Oc1cc(=O)oc2cc(ccc12)-c1nc(C(=O)c2c(Cl)cccc2C(F)(F)F)n2CCCCc12
InChI Key InChIKey=CWAMGKFHFVUIDI-UHFFFAOYSA-N
Data  1 EC50
  Tab Delimited (TSV)   2D SDfile   Computed 3D by Vconf -m prep SDfile
Find this compound or compounds like it in BindingDB:
Activity Spreadsheet -- Enzyme Inhibition Constant Data from BindingDB
Found 1 hit for monomerid = 268477
TargetNuclear receptor ROR-gamma [262-507](Homo sapiens (Human))
Genentech
US Patent
LigandPNGBDBM268477(7-[3-[2-chloro-6- (trifluoromethyl)benzoyl]-5,6,7,...)
Affinity DataEC50:  1.60E+3nMT: 2°C. Assay description: ssays were carried out in 16-μL reaction volumes in black 384 Plus F Proxiplates (Perkin-Elmer 6008269). All assay components except test ligand...
Ligand InfoPC cidPC sid
In DepthDetails US Patent