BDBM268519 N-(7-((3-chloro-5-(trifluoromethoxy)phenoxy)methyl)-6-cyclopropyl-[1,2,4]triazolo[4,3-a]pyridin-3-yl)methanesulfonamide::US9550775, 43::US9550775, 98
SMILES CS(=O)(=O)Nc1nnc2cc(COc3cc(Cl)cc(OC(F)(F)F)c3)c(cn12)C1CC1
InChI Key InChIKey=CDHSZWUVOIXMRK-UHFFFAOYSA-N
Data  2 IC50
  Tab Delimited (TSV)   2D SDfile   Computed 3D by Vconf -m prep SDfile
Find this compound or compounds like it in BindingDB:
Activity Spreadsheet -- Enzyme Inhibition Constant Data from BindingDB
Found 2 hits for monomerid = 268519
TargetSodium channel protein type 9 subunit alpha(Homo sapiens (Human))
Genentech
US Patent
LigandPNGBDBM268519(N-(7-((3-chloro-5-(trifluoromethoxy)phenoxy)methyl...)
Affinity DataIC50:  3nMpH: 7.2Assay Description:The following patch voltage clamp electrophysiology studies were performed on representative compounds of the invention using human embryonic kidney ...
Ligand InfoPC cidPC sid
In DepthDetails US Patent
TargetSodium channel protein type 9 subunit alpha(Homo sapiens (Human))
Genentech
US Patent
LigandPNGBDBM268519(N-(7-((3-chloro-5-(trifluoromethoxy)phenoxy)methyl...)
Affinity DataIC50:  2.5nMpH: 7.2Assay Description:The following patch voltage clamp electrophysiology studies were performed on representative compounds of the invention using human embryonic kidney ...
Ligand InfoPC cidPC sid
In DepthDetails US Patent