BDBM268603 N-(7-(adamantan-1-ylmethoxy)-6-ethyl-[1,2,4]triazolo[4,3-a]pyridin-3-yl)azetidine-1-sulfonamide::US9550775, 126
SMILES CCc1cn2c(NS(=O)(=O)N3CCC3)nnc2cc1OCC12CC3CC(CC(C3)C1)C2
InChI Key InChIKey=CVYRLCCBKFURBW-UHFFFAOYSA-N
Data  1 IC50
  Tab Delimited (TSV)   2D SDfile   Computed 3D by Vconf -m prep SDfile
Find this compound or compounds like it in BindingDB:
Activity Spreadsheet -- Enzyme Inhibition Constant Data from BindingDB
Found 1 hit for monomerid = 268603
TargetSodium channel protein type 9 subunit alpha(Homo sapiens (Human))
Genentech
US Patent
LigandPNGBDBM268603(N-(7-(adamantan-1-ylmethoxy)-6-ethyl-[1,2,4]triazo...)
Affinity DataIC50:  31nMpH: 7.2Assay Description:The following patch voltage clamp electrophysiology studies were performed on representative compounds of the invention using human embryonic kidney ...
Ligand InfoPC cidPC sid
In DepthDetails US Patent