BDBM268660 US9718825, Example 62
SMILES NCCCOc1nc(nc2[nH]ncc12)-c1ccc(NS(=O)(=O)c2cc(Cl)ccc2F)cc1
InChI Key InChIKey=NXHDVGHEOSSIKI-UHFFFAOYSA-N
Data  1 IC50
  Tab Delimited (TSV)   2D SDfile   Computed 3D by Vconf -m prep SDfile
Find this compound or compounds like it in BindingDB:
Activity Spreadsheet -- Enzyme Inhibition Constant Data from BindingDB
Found 1 hit for monomerid = 268660
TargetSerine/threonine-protein kinase Sgk1(Homo sapiens (Human))
Sanofi
US Patent
LigandPNGBDBM268660(US9718825, Example 62)
Affinity DataIC50: <1.20nMpH: 7.4Assay Description:The compounds were tested for serum and glucocorticoid-regulated kinase 1 (SGK-1) inhibitory activity in a substrate phosphorylation assay designed t...
Ligand InfoPC cidPC sid
In DepthDetails US Patent