BDBM269299 (R)-1-((1-(cyclopropanecarbonyl)pyrrolidin-3-yl)methyl)-2-(2-fluoro-4-(quinazolin-7-yl)phenyl)-4,4-dimethyl-1H-imidazol-5(4H)-one ::US10413545, Compound 44::US9718813, Compound 44
SMILES CC1(C)N=C(N(C[C@@H]2CCN(C2)C(=O)C2CC2)C1=O)c1ccc(cc1F)-c1ccc2cncnc2c1
InChI Key InChIKey=GKSCLKZJFQTLPO-QGZVFWFLSA-N
Data  3 IC50
  Tab Delimited (TSV)   2D SDfile   Computed 3D by Vconf -m prep SDfile
Find this compound or compounds like it in BindingDB:
Activity Spreadsheet -- Enzyme Inhibition Constant Data from BindingDB
Found 3 hits for monomerid = 269299
TargetFatty acid synthase(Homo sapiens (Human))
Janssen Pharmaceutica
US Patent
LigandPNGBDBM269299((R)-1-((1-(cyclopropanecarbonyl)pyrrolidin-3-yl)me...)
Affinity DataIC50:  162nMpH: 7.5 T: 2°C. Assay description: In this assay, inhibition of FASN activity is measured using 3H-acetyl-CoA and malonyl-CoA as substrates. 3H-Acetyl CoA is converted to 3H-palmitate ...
Ligand InfoPC cidPC sid
In DepthDetails US Patent
TargetFatty acid synthase(Homo sapiens (Human))
Janssen Pharmaceutica
US Patent
LigandPNGBDBM269299((R)-1-((1-(cyclopropanecarbonyl)pyrrolidin-3-yl)me...)
Affinity DataIC50:  162nM. Assay description: In this assay, inhibition of FASN activity is measured using 3H-acetyl-CoA and malonyl-CoA as substrates. 3H-Acetyl CoA is converted to 3H-palmitate ...
Ligand InfoPC cidPC sid
In DepthDetails US Patent
Target1,5-anhydro-D-fructose reductase(Homo sapiens (Human))
Janssen Pharmaceutica
US Patent
LigandPNGBDBM269299((R)-1-((1-(cyclopropanecarbonyl)pyrrolidin-3-yl)me...)
Affinity DataIC50:  224nMpH: 7.5 T: 2°C. Assay description: 10 μL assay buffer (100 mM KH2PO4 pH 7.5) was added to a 384-well clear plate (costar 3702). 0.3 μL compound (at concentrations of 30 μ...
Ligand InfoPC cidPC sid
In DepthDetails US Patent