BDBM269319 (R)-1-((1-(cyclopropanecarbonyl)pyrrolidin-3-yl)methyl)-4,4-dimethyl-2-(4-(quinolin-6-yl)phenyl)-1H-imidazol-5(4H)-one ::US10413545, Compound 64::US9718813, Compound 64
SMILES CC1(C)N=C(N(C[C@@H]2CCN(C2)C(=O)C2CC2)C1=O)c1ccc(cc1)-c1ccc2ncccc2c1
InChI Key InChIKey=CAISCGRGRJGJKH-LJQANCHMSA-N
Data  2 IC50
  Tab Delimited (TSV)   2D SDfile   Computed 3D by Vconf -m prep SDfile
Find this compound or compounds like it in BindingDB:
Activity Spreadsheet -- Enzyme Inhibition Constant Data from BindingDB
Found 2 hits for monomerid = 269319
TargetFatty acid synthase(Homo sapiens (Human))
Janssen Pharmaceutica
US Patent
LigandPNGBDBM269319((R)-1-((1-(cyclopropanecarbonyl)pyrrolidin-3-yl)me...)
Affinity DataIC50:  2.14E+3nM. Assay description: In this assay, inhibition of FASN activity is measured using 3H-acetyl-CoA and malonyl-CoA as substrates. 3H-Acetyl CoA is converted to 3H-palmitate ...
Ligand InfoPC cidPC sid
In DepthDetails US Patent
TargetFatty acid synthase(Homo sapiens (Human))
Janssen Pharmaceutica
US Patent
LigandPNGBDBM269319((R)-1-((1-(cyclopropanecarbonyl)pyrrolidin-3-yl)me...)
Affinity DataIC50:  2.14E+3nMpH: 7.5 T: 2°C. Assay description: In this assay, inhibition of FASN activity is measured using 3H-acetyl-CoA and malonyl-CoA as substrates. 3H-Acetyl CoA is converted to 3H-palmitate ...
Ligand InfoPC cidPC sid
In DepthDetails US Patent