BDBM269330 (R)-2-(2-fluoro-4-(6-fluoronaphthalen-2-yl)phenyl)-4,4-dimethyl-1-((1-(1-methylcyclopropanecarbonyl)pyrrolidin-3-yl)methyl)-1H-imidazol-5(4H)-one ::US10413545, Compound 75::US9718813, Compound 75
SMILES CC1(CC1)C(=O)N1CC[C@@H](CN2C(=O)C(C)(C)N=C2c2ccc(cc2F)-c2ccc3cc(F)ccc3c2)C1
InChI Key InChIKey=PSZBHCGFGKZYCP-LJQANCHMSA-N
Data  2 IC50
  Tab Delimited (TSV)   2D SDfile   Computed 3D by Vconf -m prep SDfile
Find this compound or compounds like it in BindingDB:
Activity Spreadsheet -- Enzyme Inhibition Constant Data from BindingDB
Found 2 hits for monomerid = 269330
TargetFatty acid synthase(Homo sapiens (Human))
Janssen Pharmaceutica
US Patent
LigandPNGBDBM269330((R)-2-(2-fluoro-4-(6-fluoronaphthalen-2-yl)phenyl)...)
Affinity DataIC50:  55nM. Assay description: In this assay, inhibition of FASN activity is measured using 3H-acetyl-CoA and malonyl-CoA as substrates. 3H-Acetyl CoA is converted to 3H-palmitate ...
Ligand InfoPC cidPC sid
In DepthDetails US Patent
TargetFatty acid synthase(Homo sapiens (Human))
Janssen Pharmaceutica
US Patent
LigandPNGBDBM269330((R)-2-(2-fluoro-4-(6-fluoronaphthalen-2-yl)phenyl)...)
Affinity DataIC50:  55nMpH: 7.5 T: 2°C. Assay description: In this assay, inhibition of FASN activity is measured using 3H-acetyl-CoA and malonyl-CoA as substrates. 3H-Acetyl CoA is converted to 3H-palmitate ...
Ligand InfoPC cidPC sid
In DepthDetails US Patent