BDBM269363 (E)-3-(4-((2-(4-fluoro- 2-(trifluoromethyl)- phenyl)-6-hydroxy- benzo[b]thiophen-3- yl)oxy)phenyl)acrylic acid::US10058534, 17
SMILES OC(=O)\C=C\c1ccc(Oc2c(sc3cc(O)ccc23)-c2ccc(F)cc2C(F)(F)F)cc1
InChI Key InChIKey=QANGTFQUBXZHNJ-XCVCLJGOSA-N
Data  4 IC50
  Tab Delimited (TSV)   2D SDfile   Computed 3D by Vconf -m prep SDfile
Find this compound or compounds like it in BindingDB:
Activity Spreadsheet -- Enzyme Inhibition Constant Data from BindingDB
Found 4 hits for monomerid = 269363
TargetEstrogen receptor(Homo sapiens (Human))
Novartis
US Patent
LigandPNGBDBM269363((E)-3-(4-((2-(4-fluoro- 2-(trifluoromethyl)- pheny...)
Affinity DataIC50:  12nMpH: 5.1 T: 2°C. Assay description: The ER transcription assay is a reporter assay that is based on the ability of ER to induce transcription from a luciferase reporter gene containing ...
Ligand InfoPC cidPC sid
In DepthDetails US Patent
TargetEstrogen receptor(Homo sapiens (Human))
Novartis
US Patent
LigandPNGBDBM269363((E)-3-(4-((2-(4-fluoro- 2-(trifluoromethyl)- pheny...)
Affinity DataIC50:  1nM. Assay description: Induction of selective estrogen receptor alpha degradation in human MCF7 cells after 18 to 24 hrs by in-cell Western analysis
Ligand InfoPC cidPC sid
In DepthDetails ArticlePubMed
TargetEstrogen receptor(Homo sapiens (Human))
Novartis
US Patent
LigandPNGBDBM269363((E)-3-(4-((2-(4-fluoro- 2-(trifluoromethyl)- pheny...)
Affinity DataIC50:  12nM. Assay description: Inhibition of mammalian ribonucleotide reductase
Ligand InfoPC cidPC sid
In DepthDetails ArticlePubMed
TargetEstrogen receptor(Homo sapiens (Human))
Novartis
US Patent
LigandPNGBDBM269363((E)-3-(4-((2-(4-fluoro- 2-(trifluoromethyl)- pheny...)
Affinity DataIC50:  1nMpH: 7.4 T: 2°C. Assay description: Plate MCF7 cells at 0.3 million cells/mL (100 l/well) in black, clear-bottom 96-well plates (Greiner, catalog number 655090) in DMEM/F12 media (Gibco...
Ligand InfoPC cidPC sid
In DepthDetails US Patent