BDBM269374 US10058534, 28
SMILES C\C(=C/c1ccc(Oc2c(sc3cc(O)ccc23)-c2ccc(O)cc2)cc1)C(O)=O
InChI Key InChIKey=BPMCEHCMSBNYSA-WYMLVPIESA-N
Data  2 IC50
  Tab Delimited (TSV)   2D SDfile   Computed 3D by Vconf -m prep SDfile
Find this compound or compounds like it in BindingDB:
Activity Spreadsheet -- Enzyme Inhibition Constant Data from BindingDB
Found 2 hits for monomerid = 269374
TargetEstrogen receptor(Homo sapiens (Human))
Novartis Institutes For Biomedical Research
Curated by ChEMBL
LigandPNGBDBM269374(US10058534, 28)
Affinity DataIC50:  886nM. Assay description: Induction of selective estrogen receptor alpha degradation in human MCF7 cells harboring TK-ERE-Luc assessed as reduction in estradiol-induced transc...
Ligand InfoPC cidPC sid
In DepthDetails ArticlePubMed
TargetEstrogen receptor(Homo sapiens (Human))
Novartis Institutes For Biomedical Research
Curated by ChEMBL
LigandPNGBDBM269374(US10058534, 28)
Affinity DataIC50:  886nMpH: 5.1 T: 2°C. Assay description: The ER transcription assay is a reporter assay that is based on the ability of ER to induce transcription from a luciferase reporter gene containing ...
Ligand InfoPC cidPC sid
In DepthDetails US Patent